Target
Protein M2-1
Ligand
BDBM301500
Substrate
Meas. Tech.
Antiviral Activity
EC50
2.04±n/a nM
Citation
 Tahari, AVendeville, SMJonckers, THRaboisson, PJDemin, SDHu, L Piperidine substituted tricyclic pyrazolo[1,5-a]pyrimidine derivatives with inhibitory activity on the replication of the respiratory syncytial virus (RSV) US Patent  US10131673 Publication Date 11/20/2018 
Target
Name:
Protein M2-1
Synonyms:
Envelope-associated 22 kDa protein M21_HRSVA | Matrix M2-1
Type:
Enzyme Catalytic Domain
Mol. Mass.:
22163.59
Organism:
Human respiratory syncytial virus A (strain A2)
Description:
P04545
Residue:
194
  
Inhibitor
Name:
BDBM301500
Synonyms:
N-(2-(2-(5-(dimethylamino)-9-methyl-6,7,8,9-tetrahydropyrazolo-[1,5-a]pyrido[3,2-e]pyrimidin-2-yl)piperidine-1-carbonyl)-4-methylphenyl)methane-sulfonamide | US10131673, Compound P27
Type:
Small organic molecule
Emp. Form.:
C26H35N7O3S
Mol. Mass.:
525.666
SMILES:
CN(C)c1nc2cc(nn2c2N(C)CCCc12)C1CCCCN1C(=O)c1cc(C)ccc1NS(C)(=O)=O
: