Target
Protein M2-1
Ligand
BDBM301511
Substrate
Meas. Tech.
Antiviral Activity
EC50
162±n/a nM
Citation
 Tahari, AVendeville, SMJonckers, THRaboisson, PJDemin, SDHu, L Piperidine substituted tricyclic pyrazolo[1,5-a]pyrimidine derivatives with inhibitory activity on the replication of the respiratory syncytial virus (RSV) US Patent  US10131673 Publication Date 11/20/2018 
Target
Name:
Protein M2-1
Synonyms:
Envelope-associated 22 kDa protein M21_HRSVA | Matrix M2-1
Type:
Enzyme Catalytic Domain
Mol. Mass.:
22163.59
Organism:
Human respiratory syncytial virus A (strain A2)
Description:
P04545
Residue:
194
  
Inhibitor
Name:
BDBM301511
Synonyms:
US10131673, Compound P38
Type:
Small organic molecule
Emp. Form.:
C25H28N6
Mol. Mass.:
412.53
SMILES:
Cc1cccc2ncnc(N3CCCC[C@H]3c3cc4nc5CCCCc5c(C)n4n3)c12
: