Target
Mitogen-activated protein kinase kinase kinase 12
Ligand
BDBM301523
Substrate
Meas. Tech.
DLK TR-FRET Inhibition Assay
Ki
469±n/a nM
Citation
 Estrada, APatel, SKellar, THuestis, MShore, DSiu, M Tricyclic DLK inhibitors and uses thereof US Patent  US10131675 Publication Date 11/20/2018 
Target
Name:
Mitogen-activated protein kinase kinase kinase 12
Synonyms:
DLK Leucine-zipper protein kinase MAP3K12 MUK Mixed lineage kinase | ZPK
Type:
PROTEIN
Mol. Mass.:
93216.56
Organism:
Homo sapiens (Human)
Description:
ChEMBL_1460553
Residue:
859
  
Inhibitor
Name:
BDBM301523
Synonyms:
US10131675, Example 8
Type:
Small organic molecule
Emp. Form.:
C20H24N8O2
Mol. Mass.:
408.457
SMILES:
CC1(C)OCCn2c1nc1c(nc(nc21)-c1cnc(N)nc1)N1CCC2(COC2)C1
: