Target
Mitogen-activated protein kinase kinase kinase 12
Ligand
BDBM301613
Substrate
Meas. Tech.
DLK TR-FRET Inhibition Assay
Ki
866±n/a nM
Citation
 Estrada, APatel, SKellar, THuestis, MShore, DSiu, M Tricyclic DLK inhibitors and uses thereof US Patent  US10131675 Publication Date 11/20/2018 
Target
Name:
Mitogen-activated protein kinase kinase kinase 12
Synonyms:
DLK Leucine-zipper protein kinase MAP3K12 MUK Mixed lineage kinase | ZPK
Type:
PROTEIN
Mol. Mass.:
93216.56
Organism:
Homo sapiens (Human)
Description:
ChEMBL_1460553
Residue:
859
  
Inhibitor
Name:
BDBM301613
Synonyms:
US10131675, Example 99
Type:
Small organic molecule
Emp. Form.:
C18H17F3N8O
Mol. Mass.:
418.3758
SMILES:
Nc1ncc(cn1)-c1nc(N2CC3CC2C3)c2nc3[C@H](OCCn3c2n1)C(F)(F)F
: