Target
Mitogen-activated protein kinase kinase kinase 12
Ligand
BDBM301615
Substrate
Meas. Tech.
DLK TR-FRET Inhibition Assay
Ki
102±n/a nM
Citation
 Estrada, APatel, SKellar, THuestis, MShore, DSiu, M Tricyclic DLK inhibitors and uses thereof US Patent  US10131675 Publication Date 11/20/2018 
Target
Name:
Mitogen-activated protein kinase kinase kinase 12
Synonyms:
DLK Leucine-zipper protein kinase MAP3K12 MUK Mixed lineage kinase | ZPK
Type:
PROTEIN
Mol. Mass.:
93216.56
Organism:
Homo sapiens (Human)
Description:
ChEMBL_1460553
Residue:
859
  
Inhibitor
Name:
BDBM301615
Synonyms:
US10131675, Example 101
Type:
Small organic molecule
Emp. Form.:
C18H21N7O
Mol. Mass.:
351.4056
SMILES:
C[C@@H]1COC(C)(C)c2nc3c(nc(nc3n12)-c1cnc(N)nc1)C1CC1
: