Target
Vasopressin V1b receptor
Ligand
BDBM301672
Substrate
Meas. Tech.
In Vitro V1b Receptor Assay
EC50
249070±n/a nM
Citation
 Wisniewski, KSchteingart, CRiviere, P Vasopressin-2 receptor agonists US Patent  US10131692 Publication Date 11/20/2018 
Target
Name:
Vasopressin V1b receptor
Synonyms:
AVPR V1b AVPR1B Antidiuretic hormone receptor 1b V1bR VPR3 Vasopressin V1b receptor (V1b) Vasopressin V3 receptor
Type:
Enzyme
Mol. Mass.:
46985.01
Organism:
Homo sapiens (Human)
Description:
P47901
Residue:
424
  
Inhibitor
Name:
BDBM301672
Synonyms:
US10131692, Compound 4
Type:
Small organic molecule
Emp. Form.:
C46H67ClN12O9S2
Mol. Mass.:
1031.682
SMILES:
CCCNC(=O)[C@@H](CCCNC(N)=N)NC(=O)[C@@H]1CCCN1C(=O)[C@@H]1CSCCCC(=O)N[C@@H](Cc2ccc(Cl)cc2)C(=O)N[C@@H](Cc2cccs2)C(=O)N[C@@H](C(C)C)C(=O)N[C@@H](CC(N)=O)C(=O)N1
: