Target
Vasopressin V2 receptor
Ligand
BDBM301687
Substrate
Meas. Tech.
In Vitro V2 Receptor Assay
EC50
290±n/a nM
Citation
 Wisniewski, KSchteingart, CRiviere, P Vasopressin-2 receptor agonists US Patent  US10131692 Publication Date 11/20/2018 
Target
Name:
Vasopressin V2 receptor
Synonyms:
ADHR AVPR2 DIR Renal-type arginine vasopressin receptor V2R_HUMAN Vasopressin V2 receptor | Vasopressin receptor
Type:
Receptor
Mol. Mass.:
40295.28
Organism:
Homo sapiens (Human)
Description:
P30518
Residue:
371
  
Inhibitor
Name:
BDBM301687
Synonyms:
US10131692, Compound 19
Type:
Small organic molecule
Emp. Form.:
C47H69ClN12O9S2
Mol. Mass.:
1045.709
SMILES:
CC(C)CNC(=O)[C@H](CCCNC(N)=N)NC(=O)[C@@H]1CCCN1C(=O)[C@@H]1CSCCCC(=O)N[C@@H](Cc2ccc(Cl)cc2)C(=O)N[C@@H](Cc2cccs2)C(=O)N[C@@H](C(C)C)C(=O)N[C@@H](CC(N)=O)C(=O)N1
: