Target
Free fatty acid receptor 1
Ligand
BDBM301725
Substrate
Meas. Tech.
Pharmacological Assay
EC50
3.00±n/a nM
Citation
 Eckhardt, MFrattini, SLangkopf, EWagner, H Indanyloxydihydrobenzofuranylacetic acids US Patent  US9597310 Publication Date 3/21/2017 
Target
Name:
Free fatty acid receptor 1
Synonyms:
FFAR1 G-protein Coupled Receptor 40 | GPR40
Type:
G Protein-Coupled Receptor (GPCR)
Mol. Mass.:
31473.32
Organism:
Homo sapiens (Human)
Description:
O14842
Residue:
300
  
Inhibitor
Name:
BDBM301725
Synonyms:
US9597310, 15 | [(S)-6-{(R)-7-Fluoro-4-[4-(2-methyl-2H-tetrazol-5-yl)-phenoxy]-indan-1-yloxy}-2,3-dihydro-benzofuran-3-yl]-acetic acid
Type:
Small organic molecule
Emp. Form.:
C27H23FN4O5
Mol. Mass.:
502.4937
SMILES:
Cn1nnc(n1)-c1ccc(Oc2ccc(F)c3[C@@H](CCc23)Oc2ccc3[C@H](CC(O)=O)COc3c2)cc1
: