Target
Free fatty acid receptor 1
Ligand
BDBM301742
Substrate
Meas. Tech.
Pharmacological Assay
EC50
13.0±n/a nM
Citation
 Eckhardt, MFrattini, SLangkopf, EWagner, H Indanyloxydihydrobenzofuranylacetic acids US Patent  US9597310 Publication Date 3/21/2017 
Target
Name:
Free fatty acid receptor 1
Synonyms:
FFAR1 G-protein Coupled Receptor 40 | GPR40
Type:
G Protein-Coupled Receptor (GPCR)
Mol. Mass.:
31473.32
Organism:
Homo sapiens (Human)
Description:
O14842
Residue:
300
  
Inhibitor
Name:
BDBM301742
Synonyms:
((S)-6-{(R)-7-Fluoro-4-[4-(2-methylthiazol-4-yl)phenoxy]-indan-1-yloxy}-2,3-dihydrobenzofuran-3-yl)-acetic acid | US9597310, 32
Type:
Small organic molecule
Emp. Form.:
C29H24FNO5S
Mol. Mass.:
517.568
SMILES:
Cc1nc(cs1)-c1ccc(Oc2ccc(F)c3[C@@H](CCc23)Oc2ccc3[C@H](CC(O)=O)COc3c2)cc1
: