Target
Free fatty acid receptor 1
Ligand
BDBM301771
Substrate
Meas. Tech.
Pharmacological Assay
EC50
13.0±n/a nM
Citation
 Eckhardt, MFrattini, SLangkopf, EWagner, H Indanyloxydihydrobenzofuranylacetic acids US Patent  US9597310 Publication Date 3/21/2017 
Target
Name:
Free fatty acid receptor 1
Synonyms:
FFAR1 G-protein Coupled Receptor 40 | GPR40
Type:
G Protein-Coupled Receptor (GPCR)
Mol. Mass.:
31473.32
Organism:
Homo sapiens (Human)
Description:
O14842
Residue:
300
  
Inhibitor
Name:
BDBM301771
Synonyms:
((S)-6-{(R)-4-[4-(2-Cyanoethyl)phenoxy]-7-fluoro-indan-1-yloxy}-2,3-dihydrobenzofuran-3-yl)-acetic acid | US9597310, 61
Type:
Small organic molecule
Emp. Form.:
C28H24FNO5
Mol. Mass.:
473.4923
SMILES:
OC(=O)C[C@@H]1COc2cc(O[C@@H]3CCc4c3c(F)ccc4Oc3ccc(CCC#N)cc3)ccc12
: