Target
Leucine-rich repeat serine/threonine-protein kinase 2 [970-2527]
Ligand
BDBM254926
Substrate
Meas. Tech.
LanthaScreen Kinase Activity Assay
EC50
149±n/a nM
Citation
 PubChem, PCBedford, STChen, IWang, YWilliamson, DS Arylpyrrolopyridine derived compounds as LRRK2 inhibitors US Patent  US9675594 Publication Date 6/13/2017 
Target
Name:
Leucine-rich repeat serine/threonine-protein kinase 2 [970-2527]
Synonyms:
LRRK2 Leucine-rich repeat kinase 2 (LRRK2 t-WT) PARK8
Type:
Protein
Mol. Mass.:
177317.56
Organism:
Homo sapiens (Human)
Description:
Human LRRK2 variant (970-2527aa)
Residue:
1558
  
Inhibitor
Name:
BDBM254926
Synonyms:
US9499542, 9 | US9675594, 9
Type:
Small organic molecule
Emp. Form.:
C21H22N4O
Mol. Mass.:
346.4256
SMILES:
CCc1cc(ccc1CN1CCOCC1)-c1ccnc2[nH]cc(C#N)c12
: