Target
Toll-like receptor 7
Ligand
BDBM50189181
Substrate
Meas. Tech.
Reporter Gene Assay
EC50
384±n/a nM
Citation
 Otten, GWu, TYWarren, TKBavari, S Benzonapthyridine compositions and uses thereof US Patent  US9597326 Publication Date 3/21/2017 
Target
Name:
Toll-like receptor 7
Synonyms:
ORF Names:UNQ248/PRO285 TLR7_HUMAN | Toll-like receptor 7 (TLR7)
Type:
Enzyme
Mol. Mass.:
120945.35
Organism:
Homo sapiens (Human)
Description:
Q9NYK1
Residue:
1049
  
Inhibitor
Name:
BDBM50189181
Synonyms:
CHEMBL3828229 | US9597326, Compound 21
Type:
Small organic molecule
Emp. Form.:
C30H36N3O8P
Mol. Mass.:
597.5959
SMILES:
Cc1cc(OCCOCCOCCP(O)(O)=O)ccc1CCc1cnc2c(N)nc3cc(CCC(O)=O)ccc3c2c1
: