Target
Toll-like receptor 7
Ligand
BDBM254796
Substrate
Meas. Tech.
Pharmacological Assay
EC50
>100000±n/a nM
Citation
 Hoves, SWang, LYun, HZhang, WZhu, W Benzazepine dicarboxamide compounds US Patent  US9597333 Publication Date 3/21/2017 
Target
Name:
Toll-like receptor 7
Synonyms:
ORF Names:UNQ248/PRO285 TLR7_HUMAN | Toll-like receptor 7 (TLR7)
Type:
Enzyme
Mol. Mass.:
120945.35
Organism:
Homo sapiens (Human)
Description:
Q9NYK1
Residue:
1049
  
Inhibitor
Name:
BDBM254796
Synonyms:
US9475775, 63 | US9597333, 63
Type:
Small organic molecule
Emp. Form.:
C26H32FN5O2
Mol. Mass.:
465.563
SMILES:
CCCN(CCC)C(=O)C1=Cc2ccc(cc2N=C(N)C1)C(=O)Nc1ccc(F)c(CCN)c1
: