Target
Vascular endothelial growth factor A
Ligand
BDBM107707
Substrate
EC50
15000±n/a nM
Citation
 Kawamoto, RMWu, SEvdokimov, AGGreis, KDBoyer, ASWarshakoon, NC Prolyl hydroxylase inhibitors and methods of use US Patent  US9598370 Publication Date 3/21/2017 
Target
Name:
Vascular endothelial growth factor A
Synonyms:
VEGF VEGFA VPF Vascular endothelial growth factor A (VEGF) Vascular permeability factor
Type:
Protein
Mol. Mass.:
27063.81
Organism:
Homo sapiens (Human)
Description:
P15692
Residue:
395
  
Inhibitor
Name:
BDBM107707
Synonyms:
US11426393, Compound Table XV.13 US8722895, 13: {[5-(4-Isopropylphenyl)-3-hydroxypyridine- 2-carbonyl]amino}-acetic acid USRE47437, Example {[5-(4-Isopropylphenyl)-3-hydroxypyridine-2-carbonyl]amino}-acetic acid
Type:
Small organic molecule
Emp. Form.:
C17H18N2O4
Mol. Mass.:
314.3358
SMILES:
CC(C)c1ccc(cc1)-c1cnc(C(=O)NCC(O)=O)c(O)c1
: