Target
Egl nine homolog 1
Ligand
BDBM107709
Substrate
Meas. Tech.
Activity Assay
IC50
1600±n/a nM
Citation
 Kawamoto, RMWu, SEvdokimov, AGGreis, KDBoyer, ASWarshakoon, NC Prolyl hydroxylase inhibitors and methods of use US Patent  US9598370 Publication Date 3/21/2017 
Target
Name:
Egl nine homolog 1
Synonyms:
C1orf12 EGLN1_HUMAN Hypoxia-inducible factor prolyl hydroxylase 2 (HIF-PH2) Prolyl hydroxylase domain-containing protein 2 (PHD2)
Type:
Protein
Mol. Mass.:
46035.59
Organism:
Homo sapiens (Human)
Description:
Q9GZT9
Residue:
426
  
Inhibitor
Name:
BDBM107709
Synonyms:
US11426393, Compound Table XV.15 US8722895, 15: {[5-(4-Isopropoxyphenyl)-3- hydroxypyridine-2-carbonyl]amino}-acetic acid USRE47437, Example {[5-(4-Isopropoxyphenyl)-3-hydroxypyridine-2-carbonyl]amino}-aceticacid
Type:
Small organic molecule
Emp. Form.:
C17H18N2O5
Mol. Mass.:
330.3352
SMILES:
CC(C)Oc1ccc(cc1)-c1cnc(C(=O)NCC(O)=O)c(O)c1
: