Target
D(3) dopamine receptor
Ligand
BDBM301790
Substrate
Meas. Tech.
Binding Assay
Ki
0.390±0.10 nM
Citation
 Ananthan, S Urea and amide derivatives of aminoalkylpiperazines and use thereof US Patent  US9598387 Publication Date 3/21/2017 
Target
Name:
D(3) dopamine receptor
Synonyms:
DOPAMINE D3 DRD3_HUMAN Dopamine D3 receptor (D3) Dopamine receptor Dopamine receptor D3
Type:
Mol. Mass.:
44243.43
Organism:
Homo sapiens (Human)
Description:
Residue:
400
  
Inhibitor
Name:
BDBM301790
Synonyms:
N-(4-(4-(2,3-Dichlorophenyl)piperazin-1-yl)butyl)-4-phenylpiperazine-1-carboxamide US9969743, 3
Type:
Small organic molecule
Emp. Form.:
C25H33Cl2N5O
Mol. Mass.:
490.468
SMILES:
Clc1cccc(N2CCN(CCCCNC(=O)N3CCN(CC3)c3ccccc3)CC2)c1Cl
: