Target
Glycogen synthase kinase-3 beta [7-25]
Ligand
BDBM7854
Substrate
GSK-3 Peptide Substrate
Meas. Tech.
Kinase Inhibition Assay
pH
7.5±n/a
Temperature
310.15±n/a K
IC50
3000±n/a nM
Citation
 Conde, SPerez, DIMartinez, APerez, CMoreno, FJ Thienyl and phenyl alpha-halomethyl ketones: new inhibitors of glycogen synthase kinase (GSK-3 beta) from a library of compound searching. J Med Chem 46:4631-3 (2003)  
Target
Name:
Glycogen synthase kinase-3 beta [7-25]
Synonyms:
G1T8E2_RABIT GSK3B | Glycogen Synthase Kinase-3, beta
Type:
Enzyme fragment
Mol. Mass.:
1972.14
Organism:
Oryctolagus cuniculus (rabbit)
Description:
Glycogen Synthase Kinase-3 is the beta isoform of the rabbit enzyme produced in E.coli.. Only partial sequence is available.
Residue:
19
TTSFAESCKPVQQPSAFGS
  
Inhibitor
Name:
BDBM7854
Synonyms:
1-(4-bromothiophen-2-yl)-2-chloroethan-1-one | Chloromethyl Thienyl Ketone deriv. 2
Type:
Small organic molecule
Emp. Form.:
C6H4BrClOS
Mol. Mass.:
239.517
SMILES:
ClCC(=O)c1cc(Br)cs1
:
Substrate
Name:
GSK-3 Peptide Substrate
Synonyms:
GS-1 Peptide | Phospho-GS2 Substrate Peptide
Type:
Peptide
Mol. Mass.:
3045.17
Organism:
Description:
Residue:
27