Target
5-hydroxytryptamine receptor 1A
Ligand
BDBM301989
Substrate
Meas. Tech.
Binding Affinity Human 5-HT1A Receptor Test
Ki
14.0±n/a nM
Citation
 Zhang, YJin, CZhou, R Substituted heteroaryl compounds and methods of use thereof US Patent  US9598401 Publication Date 3/21/2017 
Target
Name:
5-hydroxytryptamine receptor 1A
Synonyms:
5-HT-1A 5-hydroxytryptamine receptor 1A (5-HT-1A) ADRB2RL1 Dopamine D2 receptor and serotonin 1a receptor HTR1A | Serotonin receptor 1A
Type:
Mol. Mass.:
46122.49
Organism:
Homo sapiens (Human)
Description:
Residue:
422
  
Inhibitor
Name:
BDBM301989
Synonyms:
2-(4-(4-(5-Fluoro-1H-indol-3-yl)butyl)piperazin-1-yl)-4-methylthiazole-5-carbonitrile | US9598401, Example 45
Type:
Small organic molecule
Emp. Form.:
C21H24FN5S
Mol. Mass.:
397.512
SMILES:
Cc1nc(sc1C#N)N1CCN(CCCCc2c[nH]c3ccc(F)cc23)CC1
: