Target
Tyrosine-protein kinase SYK
Ligand
BDBM301995
Substrate
Meas. Tech.
Homogeneous Time-Resolved Fluorescence (HTRF) Assay
IC50
1.31±n/a nM
Citation
 Altman, MDAndresen, BMArrington, KLChilders, KKDi Francesco, MEEllis, JMHaidle, AMLiu, YNorthrup, ABO Boyle, BOtte, RDReutershan, MHVitharana, DWoo, HC Thiazole-substituted aminopyridines as spleen tyrosine kinase inhibitors US Patent  US9598405 Publication Date 3/21/2017 
Target
Name:
Tyrosine-protein kinase SYK
Synonyms:
KSYK_HUMAN Spleen Tyrosine Kinase Tyrosine-protein kinase SYK (Syk)
Type:
Enzyme
Mol. Mass.:
72079.99
Organism:
Homo sapiens (Human)
Description:
P43405
Residue:
635
  
Inhibitor
Name:
BDBM301995
Synonyms:
US9598405, 1.3
Type:
Small Organic Molecule
Emp. Form.:
C27H32N4O3S
Mol. Mass.:
492.633
SMILES:
COC(=O)[C@H]1CC[C@@](O)(CC1(C)C)c1ncc(s1)-c1cc(C)cc(Nc2cc(ccn2)C2CC2)n1
: