Target
Tyrosine-protein kinase SYK
Ligand
BDBM302029
Substrate
Meas. Tech.
Homogeneous Time-Resolved Fluorescence (HTRF) Assay
IC50
0.104±n/a nM
Citation
 Altman, MDAndresen, BMArrington, KLChilders, KKDi Francesco, MEEllis, JMHaidle, AMLiu, YNorthrup, ABO Boyle, BOtte, RDReutershan, MHVitharana, DWoo, HC Thiazole-substituted aminopyridines as spleen tyrosine kinase inhibitors US Patent  US9598405 Publication Date 3/21/2017 
Target
Name:
Tyrosine-protein kinase SYK
Synonyms:
KSYK_HUMAN Spleen Tyrosine Kinase Tyrosine-protein kinase SYK (Syk)
Type:
Enzyme
Mol. Mass.:
72079.99
Organism:
Homo sapiens (Human)
Description:
P43405
Residue:
635
  
Inhibitor
Name:
BDBM302029
Synonyms:
US9598405, 3.14
Type:
Small Organic Molecule
Emp. Form.:
C24H28N4O4S
Mol. Mass.:
468.569
SMILES:
COc1ccnc(Nc2cc(C)cc(n2)-c2cnc(s2)[C@@]2(O)CC[C@H](C(O)=O)C(C)(C)C2)c1
: