Target
Tyrosine-protein kinase SYK
Ligand
BDBM302043
Substrate
Meas. Tech.
Homogeneous Time-Resolved Fluorescence (HTRF) Assay
IC50
0.580±n/a nM
Citation
 Altman, MDAndresen, BMArrington, KLChilders, KKDi Francesco, MEEllis, JMHaidle, AMLiu, YNorthrup, ABO Boyle, BOtte, RDReutershan, MHVitharana, DWoo, HC Thiazole-substituted aminopyridines as spleen tyrosine kinase inhibitors US Patent  US9598405 Publication Date 3/21/2017 
Target
Name:
Tyrosine-protein kinase SYK
Synonyms:
KSYK_HUMAN Spleen Tyrosine Kinase Tyrosine-protein kinase SYK (Syk)
Type:
Enzyme
Mol. Mass.:
72079.99
Organism:
Homo sapiens (Human)
Description:
P43405
Residue:
635
  
Inhibitor
Name:
BDBM302043
Synonyms:
US9598405, 5.2
Type:
Small Organic Molecule
Emp. Form.:
C23H25FN4O3S
Mol. Mass.:
456.533
SMILES:
C[C@H]1C[C@@](O)(CC[C@H]1C(O)=O)c1ncc(s1)-c1cc(C)cc(Nc2cc(C)c(F)cn2)n1
: