Target
Enoyl-[acyl-carrier-protein] reductase [NADPH] FabI
Ligand
BDBM302063
Substrate
Meas. Tech.
Enzyme Inhibition Assay
IC50
2620±n/a nM
Citation
 Guillemont, JELançois, DFMotte, MMKoul, ABalemans, WM Antibacterial piperidinyl substituted 3,4-dihydro-1H-[1,8]naphthyridinones US Patent  US9598407 Publication Date 3/21/2017 
Target
Name:
Enoyl-[acyl-carrier-protein] reductase [NADPH] FabI
Synonyms:
Enoyl-[acyl-carrier-protein] reductase [NADPH] FabI FABI_STAA8 fabI
Type:
Enzyme
Mol. Mass.:
28019.03
Organism:
Staphylococcus aureus
Description:
Q2FZQ3
Residue:
256
  
Inhibitor
Name:
BDBM302063
Synonyms:
US9598407, Compound 19
Type:
Small organic molecule
Emp. Form.:
C23H20F3N3O2
Mol. Mass.:
427.419
SMILES:
FC(F)(F)c1cccc(c1)C1=CCN(CC1)C(=O)\C=C\c1cnc2NC(=O)CCc2c1
: