Target
Glutaminyl-peptide cyclotransferase
Ligand
BDBM7947
Substrate
BDBM7883
Meas. Tech.
QC Inhibition Testing
pH
8±n/a
Temperature
303.15±n/a K
Ki
184000±5000 nM
Citation
 Schilling, SNiestroj, AJRahfeld, JUHoffmann, TWermann, MZunkel, KWasternack, CDemuth, HU Identification of human glutaminyl cyclase as a metalloenzyme. Potent inhibition by imidazole derivatives and heterocyclic chelators. J Biol Chem 278:49773-9 (2003)  
Target
Name:
Glutaminyl-peptide cyclotransferase
Synonyms:
Glutaminyl Cyclase Glutaminyl-peptide cyclotransferase Glutaminyl-tRNA cyclotransferase QPCT | QPCT_HUMAN
Type:
Enzyme
Mol. Mass.:
40877.05
Organism:
Homo sapiens (Human)
Description:
Q16769
Residue:
361
  
Inhibitor
Name:
BDBM7947
Synonyms:
1-(2-Oxo-2-phenylethyl)-imidazole Imidazole N-1 deriv. 8
Type:
Small organic molecule
Emp. Form.:
C11H10N2O
Mol. Mass.:
186.2099
SMILES:
O=C(Cn1ccnc1)c1ccccc1
:
Substrate
Name:
BDBM7883
Synonyms:
(2S)-2-amino-N-(4-methyl-2-oxo-2H-chromen-7-yl)pentanediamide L-glutaminyl-4-methylcoumarinylamide
Type:
Small organic molecule
Emp. Form.:
C15H17N3O4
Mol. Mass.:
303.3132
SMILES:
Cc1cc(=O)oc2cc(NC(=O)[C@@H](N)CCC(N)=O)ccc12
: