Target
Potassium channel subfamily K member 3
Ligand
BDBM179715
Substrate
Meas. Tech.
Activity Assay
IC50
864±n/a nM
Citation
 Bialy, LLorenz, KWirth, KSteinmeyer, KHessler, GPernerstorfer, JBrendel, J Substituted 4,5,6,7-tetrahydro-1H-pyrazolo[4,3-C]pyridines, their use as medicament, and pharmaceutical preparations comprising them US Patent  US9598410 Publication Date 3/21/2017 
Target
Name:
Potassium channel subfamily K member 3
Synonyms:
Acid-sensitive potassium channel TASK-1 KCNK3 Potassium channel protein TASK-1 Potassium channel subfamily K member 3 (TASK-1) TASK1 Two pore K(+) channel KT3.1 | Two pore potassium channel KT3.1
Type:
Protein
Mol. Mass.:
43534.71
Organism:
Homo sapiens (Human)
Description:
O14649
Residue:
394
  
Inhibitor
Name:
BDBM179715
Synonyms:
US9127001, 8v | US9598410, Compound 8v
Type:
Small organic molecule
Emp. Form.:
C25H18F2N6O
Mol. Mass.:
456.4468
SMILES:
Fc1ccc(Cn2nc(c3CN(CCc23)C(=O)c2ccncn2)-c2cccc(c2)C#N)c(F)c1
: