Target
Plasmepsin II
Ligand
BDBM7981
Substrate
Peptide Substrate
Meas. Tech.
Enzyme Inhibition Measurements
pH
4.5±n/a
Temperature
295.15±n/a K
Ki
29±n/a nM
Citation
 Johansson, POChen, YBelfrage, AKBlackman, MJKvarnstrom, IJansson, KVrang, LHamelink, EHallberg, ARosenquist, ASamuelsson, B Design and synthesis of potent inhibitors of the malaria aspartyl proteases plasmepsin I and II. Use of solid-phase synthesis to explore novel statine motifs. J Med Chem 47:3353-66 (2004)  
Target
Name:
Plasmepsin II
Synonyms:
Aspartic hemoglobinase II PLM2_PLAFX Plasmepsin 2 Plasmepsin-II
Type:
Enzyme
Mol. Mass.:
51482.09
Organism:
Plasmodium falciparum
Description:
P46925
Residue:
453
  
Inhibitor
Name:
BDBM7981
Synonyms:
(3S,4S)-5-[(4-bromophenyl)methoxy]-3-hydroxy-N-[2-(3-methoxyphenyl)ethyl]-4-[(2S)-3-methyl-2-(pyridin-2-ylformamido)butanamido]pentanamide Statine-like inhibitor 20
Type:
Small organic molecule
Emp. Form.:
C32H39BrN4O6
Mol. Mass.:
655.579
SMILES:
COc1cccc(CCNC(=O)C[C@H](O)[C@H](COCc2ccc(Br)cc2)NC(=O)[C@@H](NC(=O)c2ccccn2)C(C)C)c1
:
Substrate
Name:
Peptide Substrate
Synonyms:
Type:
Peptide
Mol. Mass.:
3501.67
Organism:
Description:
Residue:
31