Target
Plasmepsin II
Ligand
BDBM7985
Substrate
Peptide Substrate
Meas. Tech.
Enzyme Inhibition Measurements
pH
4.5±n/a
Temperature
295.15±n/a K
Ki
68±n/a nM
Citation
 Johansson, POChen, YBelfrage, AKBlackman, MJKvarnstrom, IJansson, KVrang, LHamelink, EHallberg, ARosenquist, ASamuelsson, B Design and synthesis of potent inhibitors of the malaria aspartyl proteases plasmepsin I and II. Use of solid-phase synthesis to explore novel statine motifs. J Med Chem 47:3353-66 (2004)  
Target
Name:
Plasmepsin II
Synonyms:
Aspartic hemoglobinase II PLM2_PLAFX Plasmepsin 2 Plasmepsin-II
Type:
Enzyme
Mol. Mass.:
51482.09
Organism:
Plasmodium falciparum
Description:
P46925
Residue:
453
  
Inhibitor
Name:
BDBM7985
Synonyms:
(3S,4S)-5-[(4-bromophenyl)methoxy]-N-butyl-3-hydroxy-4-[(2S)-3-methyl-2-(pyridin-2-ylformamido)butanamido]pentanamide Pyridine-2-carboxylic Acid {(S)-1-[(1S,2S)-1-(4-Bromobenzyloxymethyl)-3-butylcarbamoyl-2-hydroxypropylcarbamoyl]-2-methylpropyl}amide | Statine-like inhibitor 24
Type:
Small organic molecule
Emp. Form.:
C27H37BrN4O5
Mol. Mass.:
577.51
SMILES:
CCCCNC(=O)C[C@H](O)[C@H](COCc1ccc(Br)cc1)NC(=O)[C@@H](NC(=O)c1ccccn1)C(C)C
:
Substrate
Name:
Peptide Substrate
Synonyms:
Type:
Peptide
Mol. Mass.:
3501.67
Organism:
Description:
Residue:
31