Target
Cathepsin D
Ligand
BDBM7974
Substrate
Peptide Substrate
Meas. Tech.
Enzyme Inhibition Measurements
Ki
21±n/a nM
Citation
 Johansson, POChen, YBelfrage, AKBlackman, MJKvarnstrom, IJansson, KVrang, LHamelink, EHallberg, ARosenquist, ASamuelsson, B Design and synthesis of potent inhibitors of the malaria aspartyl proteases plasmepsin I and II. Use of solid-phase synthesis to explore novel statine motifs. J Med Chem 47:3353-66 (2004)  
Target
Name:
Cathepsin D
Synonyms:
CATD_HUMAN CTSD Cathepsin D heavy chain Cathepsin D precursor
Type:
Enzyme
Mol. Mass.:
44551.72
Organism:
Homo sapiens (Human)
Description:
Human proCathepsin D (SwissProt accession number P07339) was expressed in Sf9 cells, purified, and autoactivated.
Residue:
412
  
Inhibitor
Name:
BDBM7974
Synonyms:
(3S,4S)-N-[(1S)-1-{[(1S)-1-carbamoyl-3-methylbutyl]carbamoyl}ethyl]-3-hydroxy-4-[(2S)-3-methyl-2-(pyridin-2-ylformamido)butanamido]-5-phenylpentanamide Statine-like inhibitor A
Type:
Small organic molecule
Emp. Form.:
C31H44N6O6
Mol. Mass.:
596.7177
SMILES:
CC(C)C[C@H](NC(=O)[C@H](C)NC(=O)C[C@H](O)[C@H](Cc1ccccc1)NC(=O)[C@@H](NC(=O)c1ccccn1)C(C)C)C(N)=O
:
Substrate
Name:
Peptide Substrate
Synonyms:
Type:
Peptide
Mol. Mass.:
3501.67
Organism:
Description:
Residue:
31