BDBM101886 US9695163, 22
SMILES C[C@@H]1CC[C@H](CN1C(=O)c1ccc(F)cc1-n1nccn1)c1nc(c(C)s1)C(C)(C)O
InChI Key InChIKey=HDPALDJRGVHCAI-UKRRQHHQSA-N
Data  2 IC50
  Tab Delimited (TSV)   2D SDfile   Computed 3D by Vconf -m prep SDfile
Find this compound or compounds like it in BindingDB:
Activity Spreadsheet -- Enzyme Inhibition Constant Data from BindingDB
Found 2 hits for monomerid = 101886
TargetOrexin/Hypocretin receptor type 1(Homo sapiens (Human))
Merck Sharp & Dohme
US Patent
LigandPNGBDBM101886(US9695163, 22)
Affinity DataIC50:  930nMT: 2°C. Assay description: Briefly, for intracellular calcium measurements, Chinese hamster ovary (CHO) cells expressing the orexin-1 receptor (e.g., rat or human) or the orexi...
In DepthDetails US Patent
TargetOrexin receptor type 2(Homo sapiens (Human))
Merck Sharp & Dohme
US Patent
LigandPNGBDBM101886(US9695163, 22)
Affinity DataIC50:  20nMT: 2°C. Assay description: Briefly, for intracellular calcium measurements, Chinese hamster ovary (CHO) cells expressing the orexin-1 receptor (e.g., rat or human) or the orexi...
In DepthDetails US Patent