BDBM102252 US9695165, 24
SMILES COc1cc(OC)c(Cl)c(c1Cl)-c1ccc2nc(ncc2c1)-c1cc2N(CCOc2cc1C)C(=O)C=C
InChI Key InChIKey=FNPGBBNIHLCSGJ-UHFFFAOYSA-N
Data  2 IC50
  Tab Delimited (TSV)   2D SDfile   Computed 3D by Vconf -m prep SDfile
Find this compound or compounds like it in BindingDB:
Activity Spreadsheet -- Enzyme Inhibition Constant Data from BindingDB
Found 2 hits for monomerid = 102252
TargetEukaryotic translation initiation factor 2-alpha kinase 3(Homo sapiens (Human))
Blueprint Medicines
US Patent
LigandPNGBDBM102252(US9695165, 24)
Affinity DataIC50:  55nM. Assay description: MDA-MB453 cells were plated in 96-well cell culture plates at a density of 1x105 cells. Cells were allowed to attach, and growth media was replaced w...
In DepthDetails US Patent
TargetFibroblast growth factor receptor 4(Homo sapiens (Human))
Blueprint Medicines
US Patent
LigandPNGBDBM102252(US9695165, 24)
Affinity DataIC50:  55nMpH: 7.5 T: 2°C. Assay description: In each well of a 384-well plate, 0.5 ng/ul of wild type FGFR-4 (Carna Biosciences, Inc.) was incubated in a total of 12.5 ul of buffer (100 mM HEPES...
In DepthDetails US Patent