BDBM102501 US8536175, 2
SMILES CCN1CCN(CC1)c1cccc(NC(=O)c2ccc(-c3c(Cl)c(OC)cc(OC)c3Cl)c3nccnc23)c1
InChI Key InChIKey=LDHNCFCMHGDYQB-UHFFFAOYSA-N
Data  2 IC50
  Tab Delimited (TSV)   2D SDfile   Computed 3D by Vconf -m prep SDfile
Find this compound or compounds like it in BindingDB:
Activity Spreadsheet -- Enzyme Inhibition Constant Data from BindingDB
Found 2 hits for monomerid = 102501
TargetFibroblast growth factor receptor 3(Homo sapiens (Human))
Novartis
US Patent
LigandPNGBDBM102501(US8536175, 2)
Affinity DataIC50:  530nMT: 2°C. Assay description: The assay has been run at room temperature on a liquid handling robot. To the assay plates containing 50 mL compound or control solutions, 4.5 uL of ...
In DepthDetails US Patent
TargetFibroblast growth factor receptor 3(Homo sapiens (Human))
Novartis
US Patent
LigandPNGBDBM102501(US8536175, 2)
Affinity DataIC50:  530nM. Assay description: Protein kinase activity measured by the microfluidic caliper method.
In DepthDetails US Patent