BDBM102980 US8546435, 8
SMILES COc1ccc(Cn2c(nnc2[C@@H](Cc2c[nH]c3ccccc23)NC(=O)C(C)(C)N)[C@@H](Cc2c[nH]c3ccccc23)NC(C)=O)cc1
InChI Key InChIKey=OMEYXMRIYJZPAD-ROJLCIKYSA-N
Data  1 KI  3 IC50
  Tab Delimited (TSV)   2D SDfile   Computed 3D by Vconf -m prep SDfile
Find this compound or compounds like it in BindingDB:
Activity Spreadsheet -- Enzyme Inhibition Constant Data from BindingDB
Found 4 hits for monomerid = 102980
TargetGrowth hormone secretagogue receptor type 1(Homo sapiens (Human))
University Of Montpellier
Curated by ChEMBL
LigandPNGBDBM102980(US8546435, 8)
Affinity DataKi:  12nM. Assay description: Displacement of [125I]-His9-ghrelin from human GHS-R1a transfected in pig LLC PK-1 cell membranes after 60 mins by gamma counting method
In DepthDetails ArticlePubMed
TargetGrowth hormone secretagogue receptor type 1(Homo sapiens (Human))
University Of Montpellier
Curated by ChEMBL
LigandPNGBDBM102980(US8546435, 8)
Affinity DataIC50:  19nM. Assay description: Antagonist activity at human GHS-R1a transfected in CHO cells assessed as inhibition of ghrelin-induced intracellular calcium mobilization measured o...
In DepthDetails ArticlePubMed
TargetGrowth hormone secretagogue receptor type 1(Homo sapiens (Human))
University Of Montpellier
Curated by ChEMBL
LigandPNGBDBM102980(US8546435, 8)
Affinity DataIC50:  1.40nM. Assay description: Competitive binding assay using ghrelin receptor.
In DepthDetails US Patent
TargetGrowth hormone secretagogue receptor type 1(Homo sapiens (Human))
University Of Montpellier
Curated by ChEMBL
LigandPNGBDBM102980(US8546435, 8)
Affinity DataIC50:  22nM. Assay description: Antagonist activity at human GHS-R1a transfected in mouse LTK cells after 6 hrs by CRE/luciferase reporter gene assay in presence of ghrelin and roli...
In DepthDetails ArticlePubMed