BDBM104246 US8575145, 123
SMILES Cc1ccn2c(nnc2c1)-c1ccc2cccc(OCC(C)(C)CN)c2n1
InChI Key InChIKey=PDRMZIBUTGMDNS-UHFFFAOYSA-N
Data  2 IC50
  Tab Delimited (TSV)   2D SDfile   Computed 3D by Vconf -m prep SDfile
Find this compound or compounds like it in BindingDB:
Activity Spreadsheet -- Enzyme Inhibition Constant Data from BindingDB
Found 2 hits for monomerid = 104246
TargetSerine/threonine-protein kinase pim-2(Homo sapiens (Human))
Array Biopharma
US Patent
LigandPNGBDBM104246(US8575145, 123)
Affinity DataIC50:  156nMpH: 7.4 T: 2°C. Assay description: The assay for the determination of PIM activity is based on the incorporation of [33P] ATP into PIM2tide substrate and capture of the radiolabeled pe...
In DepthDetails US Patent
TargetSerine/threonine-protein kinase pim-1(Homo sapiens (Human))
Array Biopharma
US Patent
LigandPNGBDBM104246(US8575145, 123)
Affinity DataIC50:  0.900nMpH: 7.4 T: 2°C. Assay description: The assay for the determination of PIM activity is based on the incorporation of [33P] ATP into PIM2tide substrate and capture of the radiolabeled pe...
In DepthDetails US Patent