BDBM10646 2-arylpurine deriv. 11::4-{6-[(2-methoxyethyl)amino]-9-(propan-2-yl)-9H-purin-2-yl}-N-methylbenzamide
SMILES CNC(=O)c1ccc(cc1)-c1nc(NCCOC)c2ncn(C(C)C)c2n1
InChI Key InChIKey=AJMJJTGESUBGFD-UHFFFAOYSA-N
Data  3 IC50
  Tab Delimited (TSV)   2D SDfile   Computed 3D by Vconf -m prep SDfile
Find this compound or compounds like it in BindingDB:
Activity Spreadsheet -- Enzyme Inhibition Constant Data from BindingDB
Found 3 hits for monomerid = 10646
TargetCyclin-dependent kinase 1/G2/mitotic-specific cyclin-B(Marthasterias glacialis (starfish))
Institut Curie
LigandPNGBDBM10646(2-arylpurine deriv. 11 | 4-{6-[(2-methoxyethyl)ami...)
Affinity DataIC50:  3.10E+3nMpH: 7.2 T: 2°C. Assay description: Kinase activities were assayed in buffers containing substrate, enzyme, and inhibitor at 30 °C in the presence of 15 uM ATP/[gamma-32P] ATP. 32P...
In DepthDetails ArticlePubMed
TargetGlycogen synthase kinase-3 beta(Rattus norvegicus (rat))
Institut Curie
LigandPNGBDBM10646(2-arylpurine deriv. 11 | 4-{6-[(2-methoxyethyl)ami...)
Affinity DataIC50: >1.00E+5nMT: 2°C. Assay description: Kinase activities were assayed in buffers containing substrate, enzyme, and inhibitor at 30 °C in the presence of 15 uM ATP/[gamma-32P] ATP. 32P...
In DepthDetails ArticlePubMed
TargetCyclin-dependent kinase 5 activator 1 [99-307](Homo sapiens (Human))
Institut Curie
LigandPNGBDBM10646(2-arylpurine deriv. 11 | 4-{6-[(2-methoxyethyl)ami...)
Affinity DataIC50:  1.80E+3nMpH: 7.2 T: 2°C. Assay description: Kinase activities were assayed in buffers containing substrate, enzyme, and inhibitor at 30 °C in the presence of 15 uM ATP/[gamma-32P] ATP. 32P...
In DepthDetails ArticlePubMed