BDBM110896 US8614206, 447
SMILES Cn1ncc(NC(=O)c2nc(sc2N)-c2ccncc2F)c1N1CC[C@@H](N)CC(F)(F)C1
InChI Key InChIKey=JUVHLMKQQBTIQX-SNVBAGLBSA-N
Data  1 KI
  Tab Delimited (TSV)   2D SDfile   Computed 3D by Vconf -m prep SDfile
Find this compound or compounds like it in BindingDB:
Activity Spreadsheet -- Enzyme Inhibition Constant Data from BindingDB
Found 1 hit for monomerid = 110896
TargetSerine/threonine-protein kinase pim-1(Homo sapiens (Human))
F. Hoffmann-La Roche
US Patent
LigandPNGBDBM110896(US8614206, 447)
Affinity DataKi:  0.0140nMpH: 7.2Assay Description:PIM-1, -2, and -3 enzymes were generated as fusion proteins expressed in bacteria and purified by IMAC column chromatography (Sun, X., Chiu, J. F., a...
In DepthDetails US Patent