BDBM11136 (2S)-2-amino-3-[4-(2,4-difluorophenyl)phenyl]-1-(1,3-thiazolidin-3-yl)propan-1-one::aminoacylthiazolidine 23
SMILES N[C@@H](Cc1ccc(cc1)-c1ccc(F)cc1F)C(=O)N1CCSC1
InChI Key InChIKey=XHAHNYVESLHKHO-KRWDZBQOSA-N
Data  1 KI
  Tab Delimited (TSV)   2D SDfile   Computed 3D by Vconf -m prep SDfile
Find this compound or compounds like it in BindingDB:
Activity Spreadsheet -- Enzyme Inhibition Constant Data from BindingDB
Found 1 hit for monomerid = 11136
TargetDipeptidyl peptidase 4(Homo sapiens (Human))
Johnson & Johnson Pharmaceutical
LigandPNGBDBM11136((2S)-2-amino-3-[4-(2,4-difluorophenyl)phenyl]-1-(1...)
Affinity DataKi:  96nM ΔG°:  -9.57kcal/molepH: 7.4 T: 2°C. Assay description: The progress of DPPIV inhibition by compounds was measured by recording the liberation of free pNA at 405 nm. IC50 was determined from the slope of r...
In DepthDetails ArticlePubMed