BDBM117271 US8653087, I-58
SMILES Cc1ccc(cc1Nc1ncnc2c(N)nc(nc12)N1CCCN(CC1)C1CC1)C(=O)Nc1cccc(c1)C(F)(F)F
InChI Key InChIKey=LBJJGUGKTFKZDX-UHFFFAOYSA-N
Data  1 IC50
  Tab Delimited (TSV)   2D SDfile   Computed 3D by Vconf -m prep SDfile
Find this compound or compounds like it in BindingDB:
Activity Spreadsheet -- Enzyme Inhibition Constant Data from BindingDB
Found 1 hit for monomerid = 117271
TargetSerine/threonine-protein kinase B-raf [V600E](Homo sapiens (Human))
Boehringer Ingelheim International
US Patent
LigandPNGBDBM117271(US8653087, I-58)
Affinity DataIC50:  1nMpH: 7.5Assay Description:The final concentration of DMSO is 5%. 10 μL of the B-Raf (V600E)-kinase solution are pipetted in (containing 0.5 ng B-Raf (V600E)-kinase in 20 ...
In DepthDetails US Patent