BDBM119830 US8691852, 58
SMILES OC(=O)c1cc(Cl)cnc1Nc1c(F)cc(cc1F)-c1ccccc1
InChI Key InChIKey=SDPBFKBYZUOGDA-UHFFFAOYSA-N
Data  2 IC50
  Tab Delimited (TSV)   2D SDfile   Computed 3D by Vconf -m prep SDfile
Find this compound or compounds like it in BindingDB:
Activity Spreadsheet -- Enzyme Inhibition Constant Data from BindingDB
Found 2 hits for monomerid = 119830
LigandPNGBDBM119830(US8691852, 58)
Affinity DataIC50:  8nM. Assay description: Inhibition of Homo sapiens (human) dehydroorotate dihydrogenase using 2,6-dichlorophenol-indophenol as substrate after 10 min by spectrophotometric a...
In DepthDetails Article
LigandPNGBDBM119830(US8691852, 58)
Affinity DataIC50:  8nMpH: 8.0Assay Description:DHODH activity and its inhibition were studied using a chromogen reduction assay with DCIP (2,6-dichlorophenol-indophenol). The substrate oxidation (...
In DepthDetails US Patent