BDBM121045 US8722896, (-)-(3R)-1-((3- Dimethylamino)benzyl)-N-(9- chloro-3,4-dihydro-2H-1,5- benzodioxepin-7-ylmethyl)-N- isobutylpyrrolidine-3- carboxamide
SMILES CC(C)CN(Cc1cc(Cl)c2OCCCOc2c1)C(=O)C1CCN(Cc2cccc(c2)N(C)C)C1
InChI Key InChIKey=OBQBEDFGLFICRM-UHFFFAOYSA-N
Data  2 KI
  Tab Delimited (TSV)   2D SDfile   Computed 3D by Vconf -m prep SDfile
Find this compound or compounds like it in BindingDB:
Activity Spreadsheet -- Enzyme Inhibition Constant Data from BindingDB
Found 2 hits for monomerid = 121045
TargetProkineticin receptor 2(Cricetulus griseus (Chinese hamster))
The Regents of The University of California
US Patent
LigandPNGBDBM121045(US8722896, (-)-(3R)-1-((3- Dimethylamino)benzyl)-N...)
Affinity DataKi:  38.4nM ΔG°:  -10.5kcal/moleT: 2°C. Assay description: An aequorin-based luminescent assay for calcium mobilization was used to measure mobilization of intracellular Ca2+ (Bullock et al., Mol Pharmacol 65...
In DepthDetails US Patent
TargetProkineticin receptor 1(Cricetulus griseus (Chinese hamster))
The Regents of The University of California
US Patent
LigandPNGBDBM121045(US8722896, (-)-(3R)-1-((3- Dimethylamino)benzyl)-N...)
Affinity DataKi:  71.8nM ΔG°:  -10.1kcal/moleT: 2°C. Assay description: An aequorin-based luminescent assay for calcium mobilization was used to measure mobilization of intracellular Ca2+ (Bullock et al., Mol Pharmacol 65...
In DepthDetails US Patent