BDBM123130 1-(2-bromo-4-methylphenyl)-1H-pyrrole-2,5-dione (18)::CID880055
SMILES Cc1ccc(N2C(=O)C=CC2=O)c(Br)c1
InChI Key InChIKey=DHXYZCLBPGJGGL-UHFFFAOYSA-N
Data  1 IC50
  Tab Delimited (TSV)   2D SDfile   Computed 3D by Vconf -m prep SDfile
Find this compound or compounds like it in BindingDB:
Activity Spreadsheet -- Enzyme Inhibition Constant Data from BindingDB
Found 1 hit for monomerid = 123130
TargetGenome polyprotein(Hepatitis C virus)
University of Wisconsin-Milwaukee
LigandPNGBDBM123130(1-(2-bromo-4-methylphenyl)-1H-pyrrole-2,5-dione (1...)
Affinity DataIC50:  3.30E+4nMpH: 7.5 T: 2°C. Assay description: Binding assays containing 25 mM MOPS pH 7.5, 1.25 mM MgCl2, 20 nM Cy5-dT15, and 200 nM NS3h_1b were incubated 5 min at RT. Following addition of indi...
In DepthDetails ArticlePubMed