BDBM123362 US8742106, 5.2
SMILES C[C@H](NC(=O)COc1cc(C)c2c(nn(C)c2n1)-c1nccs1)c1ccc(C)cc1
InChI Key InChIKey=PCALLGUMHPYDBK-HNNXBMFYSA-N
Data  2 Kd
  Tab Delimited (TSV)   2D SDfile   Computed 3D by Vconf -m prep SDfile
Find this compound or compounds like it in BindingDB:
Activity Spreadsheet -- Enzyme Inhibition Constant Data from BindingDB
Found 2 hits for monomerid = 123362
TargetOrexin/Hypocretin receptor type 1(Homo sapiens (Human))
Novartis
US Patent
LigandPNGBDBM123362(US8742106, 5.2)
Affinity DataKd:  3nMpH: 7.5 T: 2°C. Assay description: For crude cell membrane preparations, cells (CHO, Chinese hamster ovary or HEK, human embryonic kidney) expressing human orexin 1 or human orexin 2 r...
In DepthDetails US Patent
TargetOrexin receptor type 2(Homo sapiens (Human))
Novartis
US Patent
LigandPNGBDBM123362(US8742106, 5.2)
Affinity DataKd:  3nMpH: 7.5 T: 2°C. Assay description: For crude cell membrane preparations, cells (CHO, Chinese hamster ovary or HEK, human embryonic kidney) expressing human orexin 1 or human orexin 2 r...
In DepthDetails US Patent