BDBM13485 (5S)-5-{4-[(2S)-2-(1H-1,3-benzodiazol-2-yl)-2-[(6-bromo-1,3-benzothiazol-2-yl)amino]ethyl]phenyl}-1,2-thiazolidine-1,1,3-trione::Isothiazolidinone (IZD) deriv. 21
SMILES Brc1ccc2nc(N[C@@H](Cc3ccc(cc3)[C@@H]3CC(=O)NS3(=O)=O)c3nc4ccccc4[nH]3)sc2c1
InChI Key InChIKey=VBHAFECWGPNXGH-UNMCSNQZSA-N
Data  1 IC50
  Tab Delimited (TSV)   2D SDfile   Computed 3D by Vconf -m prep SDfile
Find this compound or compounds like it in BindingDB:
Activity Spreadsheet -- Enzyme Inhibition Constant Data from BindingDB
Found 1 hit for monomerid = 13485
LigandPNGBDBM13485((5S)-5-{4-[(2S)-2-(1H-1,3-benzodiazol-2-yl)-2-[(6-...)
Affinity DataIC50:  500nM. Assay description: The activity of PTP1B enzyme was assayed with 4-nitrophenyl phosphate (pNPP) as substrate. Rate of formation of the phenolate ion was monitored at 41...
In DepthDetails ArticlePubMed