BDBM13767 (1R,3R,4S,7S)-4-[2-(4-chlorophenoxy)-2-methylpropanamido]-N-(pyridin-4-ylmethyl)adamantane-1-carboxamide::adamantane ether 21
SMILES CC(C)(Oc1ccc(Cl)cc1)C(=O)N[C@H]1C2C[C@@H]3C[C@@H]1C[C@](C3)(C2)C(=O)NCc1ccncc1
InChI Key InChIKey=ACTSGYPIYRZKBB-GKUJUCRCSA-N
Data  4 IC50
  Tab Delimited (TSV)   2D SDfile   Computed 3D by Vconf -m prep SDfile
Find this compound or compounds like it in BindingDB:
Activity Spreadsheet -- Enzyme Inhibition Constant Data from BindingDB
Found 4 hits for monomerid = 13767
Target11-beta-hydroxysteroid dehydrogenase 1(Homo sapiens (Human))
Abbott Laboratories
LigandPNGBDBM13767((1R,3R,4S,7S)-4-[2-(4-chlorophenoxy)-2-methylpropa...)
Affinity DataIC50:  25nMpH: 7.2 T: 2°C. Assay description: Enzyme assays were performed using purified recombinant human or mouse11beta-HSD1. The fractional conversion of cortisone to cortisol was used to det...
Ligand InfoPC cidPC sid
In DepthDetails ArticlePubMed
Target11-beta-hydroxysteroid dehydrogenase type 2(Mus musculus (mouse))
Abbott Laboratories
LigandPNGBDBM13767((1R,3R,4S,7S)-4-[2-(4-chlorophenoxy)-2-methylpropa...)
Affinity DataIC50:  1.90E+4nM. Assay description: The in Vitro 11beta-HSD2 dehydrogenase assays were developed using the cell lysates that had the full length human or mouse 11beta-HSD2 cDNA over exp...
Ligand InfoPC cidPC sid
In DepthDetails ArticlePubMed
Target11-beta-hydroxysteroid dehydrogenase 1(Mus musculus (mouse))
Abbott Laboratories
LigandPNGBDBM13767((1R,3R,4S,7S)-4-[2-(4-chlorophenoxy)-2-methylpropa...)
Affinity DataIC50:  14nM. Assay description: Enzyme assays were performed using purified recombinant human or mouse11beta-HSD1. The fractional conversion of cortisone to cortisol was used to det...
Ligand InfoPC cidPC sid
In DepthDetails ArticlePubMed
Target11-beta-hydroxysteroid dehydrogenase type 2(Homo sapiens (Human))
Abbott Laboratories
LigandPNGBDBM13767((1R,3R,4S,7S)-4-[2-(4-chlorophenoxy)-2-methylpropa...)
Affinity DataIC50:  5.30E+3nM. Assay description: The in Vitro 11beta-HSD2 dehydrogenase assays were developed using the cell lysates that had the full length human or mouse 11beta-HSD2 cDNA over exp...
Ligand InfoPC cidPC sid
In DepthDetails ArticlePubMed