BDBM143748 US10183953, Example 28::US8969352, 28::US8969352, 9::US9611277, Example 28::US9845333, 28
SMILES Cc1cnc(C(=O)N2CC3CC(Oc4ccc(cn4)C(F)(F)F)C2C3)c(c1)-n1nccn1
InChI Key InChIKey=OAQRBSBYWFGTPG-UHFFFAOYSA-N
Data  36 KI
  Tab Delimited (TSV)   2D SDfile   Computed 3D by Vconf -m prep SDfile
Find this compound or compounds like it in BindingDB:
Activity Spreadsheet -- Enzyme Inhibition Constant Data from BindingDB
Found 36 hits for monomerid = 143748
TargetOrexin/Hypocretin receptor type 1(Homo sapiens (Human))
TBA
US Patent
LigandPNGBDBM143748(US10183953, Example 28 | US8969352, 28 | US8969352...)
Affinity DataKi:  21nM. Assay description: Rat and Human Orexin 1 Receptor:Human Embryonic Kidney 293 cells (HEK293) stably expressing rat orexin 1 receptor (Genebank accession number NM_00152...
In DepthDetails US Patent
TargetOrexin/Hypocretin receptor type 1(Homo sapiens (Human))
TBA
US Patent
LigandPNGBDBM143748(US10183953, Example 28 | US8969352, 28 | US8969352...)
Affinity DataKi:  21nM. Assay description: CHO cells stably transfected with the human orexin 1 receptor (Genebank accession number NM_001526) were grown to confluency in DMEM/F12, 10% FBS, 1×...
In DepthDetails US Patent
TargetOrexin/Hypocretin receptor type 1(Homo sapiens (Human))
TBA
US Patent
LigandPNGBDBM143748(US10183953, Example 28 | US8969352, 28 | US8969352...)
Affinity DataKi:  21nM. Assay description: HEK293 stably expressing human orexin 2 receptor (Genebank accession number NM_001526) were grown to confluency in DMEM (Hyclone, cat # SH30022), 10%...
In DepthDetails US Patent
TargetOrexin/Hypocretin receptor type 1(Homo sapiens (Human))
TBA
US Patent
LigandPNGBDBM143748(US10183953, Example 28 | US8969352, 28 | US8969352...)
Affinity DataKi:  21nM. Assay description: CHO cells stably transfected with the human orexin 1 receptor (Genebank accession number NM_001526) were grown to confluency in DMEM/F12, 10% FBS, 1×...
In DepthDetails US Patent
TargetOrexin/Hypocretin receptor type 1(Homo sapiens (Human))
TBA
US Patent
LigandPNGBDBM143748(US10183953, Example 28 | US8969352, 28 | US8969352...)
Affinity DataKi:  21nM. Assay description: HEK293 stably expressing human orexin 2 receptor (Genebank accession number NM_001526) were grown to confluency in DMEM (Hyclone, cat # SH30022), 10%...
In DepthDetails US Patent
TargetOrexin/Hypocretin receptor type 1(Homo sapiens (Human))
TBA
US Patent
LigandPNGBDBM143748(US10183953, Example 28 | US8969352, 28 | US8969352...)
Affinity DataKi:  21nM ΔG°:  -9.73kcal/moleT: 2°C. Assay description: Human Embryonic Kidney 293 cells (HEK293) stably expressing rat orexin 1 receptor (Genebank accession number NM 001525) or Chinese ovary cells (CHO) ...
In DepthDetails US Patent
TargetOrexin/Hypocretin receptor type 1(Rattus norvegicus (Rat))
Janssen Pharmaceutica
US Patent
LigandPNGBDBM143748(US10183953, Example 28 | US8969352, 28 | US8969352...)
Affinity DataKi:  32nM. Assay description: Human Embryonic Kidney 293 cells (HEK293) stably expressing rat orexin 1 receptor (Genebank accession number NM_001525) or Chinese ovary cells (CHO) ...
In DepthDetails US Patent
TargetOrexin/Hypocretin receptor type 1(Rattus norvegicus (Rat))
Janssen Pharmaceutica
US Patent
LigandPNGBDBM143748(US10183953, Example 28 | US8969352, 28 | US8969352...)
Affinity DataKi:  32nM. Assay description: Rat and Human Orexin 1 Receptor:Human Embryonic Kidney 293 cells (HEK293) stably expressing rat orexin 1 receptor (Genebank accession number NM_00152...
In DepthDetails US Patent
TargetOrexin/Hypocretin receptor type 1(Rattus norvegicus (Rat))
Janssen Pharmaceutica
US Patent
LigandPNGBDBM143748(US10183953, Example 28 | US8969352, 28 | US8969352...)
Affinity DataKi:  32nM. Assay description: Human Embryonic Kidney 293 cells (HEK293) stably expressing rat orexin 1 receptor (Genebank accession number NM_001525) or Chinese ovary cells (CHO) ...
In DepthDetails US Patent
TargetOrexin/Hypocretin receptor type 1(Rattus norvegicus (Rat))
Janssen Pharmaceutica
US Patent
LigandPNGBDBM143748(US10183953, Example 28 | US8969352, 28 | US8969352...)
Affinity DataKi:  32nM. Assay description: Human Embryonic Kidney 293 cells (HEK293) stably expressing rat orexin 1 receptor (Genebank accession number NM_001525) or Chinese ovary cells (CHO) ...
In DepthDetails US Patent
TargetOrexin/Hypocretin receptor type 1(Rattus norvegicus (Rat))
Janssen Pharmaceutica
US Patent
LigandPNGBDBM143748(US10183953, Example 28 | US8969352, 28 | US8969352...)
Affinity DataKi:  32nM. Assay description: Human Embryonic Kidney 293 cells (HEK293) stably expressing rat orexin 1 receptor (Genebank accession number NM_001525) or Chinese ovary cells (CHO) ...
In DepthDetails US Patent
TargetOrexin/Hypocretin receptor type 1(Rattus norvegicus (Rat))
Janssen Pharmaceutica
US Patent
LigandPNGBDBM143748(US10183953, Example 28 | US8969352, 28 | US8969352...)
Affinity DataKi:  32nM ΔG°:  -9.50kcal/moleT: 2°C. Assay description: Human Embryonic Kidney 293 cells (HEK293) stably expressing rat orexin 1 receptor (Genebank accession number NM 001525) or Chinese ovary cells (CHO) ...
In DepthDetails US Patent
TargetOrexin/Hypocretin receptor type 1(Rattus norvegicus (Rat))
Janssen Pharmaceutica
US Patent
LigandPNGBDBM143748(US10183953, Example 28 | US8969352, 28 | US8969352...)
Affinity DataKi:  56nM. Assay description: Human Embryonic Kidney 293 cells (HEK293) stably expressing rat orexin 1 receptor (Genebank accession number NM_001525) or Chinese ovary cells (CHO) ...
In DepthDetails US Patent
TargetOrexin/Hypocretin receptor type 1(Rattus norvegicus (Rat))
Janssen Pharmaceutica
US Patent
LigandPNGBDBM143748(US10183953, Example 28 | US8969352, 28 | US8969352...)
Affinity DataKi:  56nM. Assay description: Human Embryonic Kidney 293 cells (HEK293) stably expressing rat orexin 1 receptor (Genebank accession number NM_001525) or Chinese ovary cells (CHO) ...
In DepthDetails US Patent
TargetOrexin/Hypocretin receptor type 1(Rattus norvegicus (Rat))
Janssen Pharmaceutica
US Patent
LigandPNGBDBM143748(US10183953, Example 28 | US8969352, 28 | US8969352...)
Affinity DataKi:  56nM. Assay description: Rat and Human Orexin 1 Receptor:Human Embryonic Kidney 293 cells (HEK293) stably expressing rat orexin 1 receptor (Genebank accession number NM_00152...
In DepthDetails US Patent
TargetOrexin/Hypocretin receptor type 1(Rattus norvegicus (Rat))
Janssen Pharmaceutica
US Patent
LigandPNGBDBM143748(US10183953, Example 28 | US8969352, 28 | US8969352...)
Affinity DataKi:  56nM ΔG°:  -9.19kcal/moleT: 2°C. Assay description: Human Embryonic Kidney 293 cells (HEK293) stably expressing rat orexin 1 receptor (Genebank accession number NM 001525) or Chinese ovary cells (CHO) ...
In DepthDetails US Patent
TargetOrexin/Hypocretin receptor type 1(Rattus norvegicus (Rat))
Janssen Pharmaceutica
US Patent
LigandPNGBDBM143748(US10183953, Example 28 | US8969352, 28 | US8969352...)
Affinity DataKi:  56nM. Assay description: Human Embryonic Kidney 293 cells (HEK293) stably expressing rat orexin 1 receptor (Genebank accession number NM_001525) or Chinese ovary cells (CHO) ...
In DepthDetails US Patent
TargetOrexin/Hypocretin receptor type 1(Rattus norvegicus (Rat))
Janssen Pharmaceutica
US Patent
LigandPNGBDBM143748(US10183953, Example 28 | US8969352, 28 | US8969352...)
Affinity DataKi:  56nM. Assay description: Human Embryonic Kidney 293 cells (HEK293) stably expressing rat orexin 1 receptor (Genebank accession number NM_001525) or Chinese ovary cells (CHO) ...
In DepthDetails US Patent
TargetOrexin/Hypocretin receptor type 1(Homo sapiens (Human))
TBA
US Patent
LigandPNGBDBM143748(US10183953, Example 28 | US8969352, 28 | US8969352...)
Affinity DataKi:  101nM. Assay description: CHO cells stably transfected with the human orexin 1 receptor (Genebank accession number NM_001526) were grown to confluency in DMEM/F12, 10% FBS, 1×...
In DepthDetails US Patent
TargetOrexin/Hypocretin receptor type 1(Homo sapiens (Human))
TBA
US Patent
LigandPNGBDBM143748(US10183953, Example 28 | US8969352, 28 | US8969352...)
Affinity DataKi:  101nM. Assay description: HEK293 stably expressing human orexin 2 receptor (Genebank accession number NM_001526) were grown to confluency in DMEM (Hyclone, cat # SH30022), 10%...
In DepthDetails US Patent
TargetOrexin/Hypocretin receptor type 1(Homo sapiens (Human))
TBA
US Patent
LigandPNGBDBM143748(US10183953, Example 28 | US8969352, 28 | US8969352...)
Affinity DataKi:  101nM ΔG°:  -8.87kcal/moleT: 2°C. Assay description: Human Embryonic Kidney 293 cells (HEK293) stably expressing rat orexin 1 receptor (Genebank accession number NM 001525) or Chinese ovary cells (CHO) ...
In DepthDetails US Patent
TargetOrexin/Hypocretin receptor type 1(Homo sapiens (Human))
TBA
US Patent
LigandPNGBDBM143748(US10183953, Example 28 | US8969352, 28 | US8969352...)
Affinity DataKi:  101nM. Assay description: Rat and Human Orexin 1 Receptor:Human Embryonic Kidney 293 cells (HEK293) stably expressing rat orexin 1 receptor (Genebank accession number NM_00152...
In DepthDetails US Patent
TargetOrexin/Hypocretin receptor type 1(Homo sapiens (Human))
TBA
US Patent
LigandPNGBDBM143748(US10183953, Example 28 | US8969352, 28 | US8969352...)
Affinity DataKi:  102nM. Assay description: HEK293 stably expressing human orexin 2 receptor (Genebank accession number NM_001526) were grown to confluency in DMEM (Hyclone, cat # SH30022), 10%...
In DepthDetails US Patent
TargetOrexin/Hypocretin receptor type 1(Homo sapiens (Human))
TBA
US Patent
LigandPNGBDBM143748(US10183953, Example 28 | US8969352, 28 | US8969352...)
Affinity DataKi:  102nM. Assay description: CHO cells stably transfected with the human orexin 1 receptor (Genebank accession number NM_001526) were grown to confluency in DMEM/F12, 10% FBS, 1×...
In DepthDetails US Patent
TargetOrexin receptor type 2(Homo sapiens (Human))
Janssen Pharmaceutica
US Patent
LigandPNGBDBM143748(US10183953, Example 28 | US8969352, 28 | US8969352...)
Affinity DataKi:  1.60E+3nM. Assay description: HEK293 stably expressing human orexin 2 receptor (Genebank accession number NM 001526) were grown to confluency in DMEM (Hyclone, cat # SH30022), 10%...
In DepthDetails US Patent
TargetOrexin receptor type 2(Homo sapiens (Human))
Janssen Pharmaceutica
US Patent
LigandPNGBDBM143748(US10183953, Example 28 | US8969352, 28 | US8969352...)
Affinity DataKi:  1.60E+3nM. Assay description: PFSK-1 cells endogenously expressing the human orexin 2 receptor were grown to confluency in RPMI1640 (Hyclone, cat #30027.02), 10% FBS, 1× pen-strep...
In DepthDetails US Patent
TargetOrexin receptor type 2(Rattus norvegicus (Rat))
TBA
US Patent
LigandPNGBDBM143748(US10183953, Example 28 | US8969352, 28 | US8969352...)
Affinity DataKi:  1.60E+3nM. Assay description: Human Orexin 2 Receptor:HEK293 stably expressing human orexin 2 receptor (Genebank accession number NM_001526) were grown to confluency in DMEM (Hycl...
In DepthDetails US Patent
TargetOrexin receptor type 2(Homo sapiens (Human))
Janssen Pharmaceutica
US Patent
LigandPNGBDBM143748(US10183953, Example 28 | US8969352, 28 | US8969352...)
Affinity DataKi:  1.60E+3nM. Assay description: HEK293 stably expressing human orexin 2 receptor (Genebank accession number NM_001526) were grown to confluency in DMEM (Hyclone, cat # SH30022), 10%...
In DepthDetails US Patent
TargetOrexin receptor type 2(Homo sapiens (Human))
Janssen Pharmaceutica
US Patent
LigandPNGBDBM143748(US10183953, Example 28 | US8969352, 28 | US8969352...)
Affinity DataKi:  1.60E+3nM. Assay description: HEK293 stably expressing human orexin 2 receptor (Genebank accession number NM_001526) were grown to confluency in DMEM (Hyclone, cat # SH30022), 10%...
In DepthDetails US Patent
TargetOrexin receptor type 2(Homo sapiens (Human))
Janssen Pharmaceutica
US Patent
LigandPNGBDBM143748(US10183953, Example 28 | US8969352, 28 | US8969352...)
Affinity DataKi:  1.60E+3nM. Assay description: PFSK-1 cells endogenously expressing the human orexin 2 receptor were grown to confluency in RPMI1640 (Hyclone, cat #30027.02), 10% FBS, 1× pen-strep...
In DepthDetails US Patent
TargetOrexin receptor type 2(Homo sapiens (Human))
Janssen Pharmaceutica
US Patent
LigandPNGBDBM143748(US10183953, Example 28 | US8969352, 28 | US8969352...)
Affinity DataKi:  2.55E+3nM. Assay description: PFSK-1 cells endogenously expressing the human orexin 2 receptor were grown to confluency in RPMI1640 (Hyclone, cat #30027.02), 10% FBS, 1× pen-strep...
In DepthDetails US Patent
TargetOrexin receptor type 2(Homo sapiens (Human))
Janssen Pharmaceutica
US Patent
LigandPNGBDBM143748(US10183953, Example 28 | US8969352, 28 | US8969352...)
Affinity DataKi:  2.55E+3nM. Assay description: HEK293 stably expressing human orexin 2 receptor (Genebank accession number NM_001526) were grown to confluency in DMEM (Hyclone, cat # SH30022), 10%...
In DepthDetails US Patent
TargetOrexin receptor type 2(Homo sapiens (Human))
Janssen Pharmaceutica
US Patent
LigandPNGBDBM143748(US10183953, Example 28 | US8969352, 28 | US8969352...)
Affinity DataKi:  2.55E+3nM. Assay description: HEK293 stably expressing human orexin 2 receptor (Genebank accession number NM 001526) were grown to confluency in DMEM (Hyclone, cat # SH30022), 10%...
In DepthDetails US Patent
TargetOrexin receptor type 2(Rattus norvegicus (Rat))
TBA
US Patent
LigandPNGBDBM143748(US10183953, Example 28 | US8969352, 28 | US8969352...)
Affinity DataKi:  2.55E+3nM. Assay description: Human Orexin 2 Receptor:HEK293 stably expressing human orexin 2 receptor (Genebank accession number NM_001526) were grown to confluency in DMEM (Hycl...
In DepthDetails US Patent
TargetOrexin receptor type 2(Homo sapiens (Human))
Janssen Pharmaceutica
US Patent
LigandPNGBDBM143748(US10183953, Example 28 | US8969352, 28 | US8969352...)
Affinity DataKi:  2.58E+3nM. Assay description: HEK293 stably expressing human orexin 2 receptor (Genebank accession number NM_001526) were grown to confluency in DMEM (Hyclone, cat # SH30022), 10%...
In DepthDetails US Patent
TargetOrexin receptor type 2(Homo sapiens (Human))
Janssen Pharmaceutica
US Patent
LigandPNGBDBM143748(US10183953, Example 28 | US8969352, 28 | US8969352...)
Affinity DataKi:  2.58E+3nM. Assay description: PFSK-1 cells endogenously expressing the human orexin 2 receptor were grown to confluency in RPMI1640 (Hyclone, cat #30027.02), 10% FBS, 1× pen-strep...
In DepthDetails US Patent