BDBM156135 US9018214, 186
SMILES CCC(F)(F)c1cnc2c(c1)N(CC2(C)C)C(=O)CN1C[C@@H](C)NC[C@@H]1CN1CCOC[C@H]1C
InChI Key InChIKey=FGYXWHPIMSKBCD-QWFCFKBJSA-N
Data  1 IC50
  Tab Delimited (TSV)   2D SDfile   Computed 3D by Vconf -m prep SDfile
Find this compound or compounds like it in BindingDB:
Activity Spreadsheet -- Enzyme Inhibition Constant Data from BindingDB
Found 1 hit for monomerid = 156135
TargetBaculoviral IAP repeat-containing protein 2(Homo sapiens (Human))
Astex Therapeutics
US Patent
LigandPNGBDBM156135(US9018214, 186)
Affinity DataIC50:  11nMpH: 7.5 T: 2°C. Assay description: Modified SMAC peptides and compounds were tested for their ability to displace the fluorescent tracer from either XIAP, clAP-1 or clAP-2. BIR3 domain...
In DepthDetails US Patent