BDBM156202 US9018214, 253
SMILES CC[C@@H]1COCCN1C[C@H]1CN[C@H](C)CN1CC(=O)N1CC(C)(C)c2ncc(cc12)C(C)(F)F
InChI Key InChIKey=VQBVIWCUEATAKI-MISYRCLQSA-N
Data  2 IC50
  Tab Delimited (TSV)   2D SDfile   Computed 3D by Vconf -m prep SDfile
Find this compound or compounds like it in BindingDB:
Activity Spreadsheet -- Enzyme Inhibition Constant Data from BindingDB
Found 2 hits for monomerid = 156202
TargetBaculoviral IAP repeat-containing protein 2(Homo sapiens (Human))
Astex Therapeutics
US Patent
LigandPNGBDBM156202(US9018214, 253)
Affinity DataIC50:  17nMpH: 7.5 T: 2°C. Assay description: Modified SMAC peptides and compounds were tested for their ability to displace the fluorescent tracer from either XIAP, clAP-1 or clAP-2. BIR3 domain...
In DepthDetails US Patent
TargetE3 ubiquitin-protein ligase XIAP(Homo sapiens (Human))
Astex Therapeutics
US Patent
LigandPNGBDBM156202(US9018214, 253)
Affinity DataIC50:  50nMpH: 7.5 T: 2°C. Assay description: Modified SMAC peptides and compounds were tested for their ability to displace the fluorescent tracer from either XIAP, clAP-1 or clAP-2. BIR3 domain...
In DepthDetails US Patent