BDBM159502 US9034921, E144::US9340521, E019
SMILES CCc1ccc(Cc2cc([C@@H]3O[C@H](CO)[C@@H](O)[C@H](O)[C@H]3O)c3SC(C)Cc3c2Cl)cc1
InChI Key InChIKey=ZQHKBHLGJODSHP-ZCUAMUNQSA-N
Data  3 IC50
  Tab Delimited (TSV)   2D SDfile   Computed 3D by Vconf -m prep SDfile
Find this compound or compounds like it in BindingDB:
Activity Spreadsheet -- Enzyme Inhibition Constant Data from BindingDB
Found 3 hits for monomerid = 159502
TargetSodium/glucose cotransporter 2(Homo sapiens (Human))
Green Cross
US Patent
LigandPNGBDBM159502(US9034921, E144 | US9340521, E019)
Affinity DataIC50:  0.976nMpH: 7.4 T: 2°C. Assay description: For sodium-dependent glucose transport assay, cells expressing hSGLT2 were seeded into a 96-well culture plate at a density of 5x104 cells/well in RP...
In DepthDetails US Patent
TargetSodium/glucose cotransporter 1(Homo sapiens (Human))
Green Cross
US Patent
LigandPNGBDBM159502(US9034921, E144 | US9340521, E019)
Affinity DataIC50:  111nMpH: 7.4 T: 2°C. Assay description: For sodium-dependent glucose transport assay, cells expressing hSGLT1 were seeded into a 96-well culture plate at a density of 5×104 cells/well...
In DepthDetails US Patent
TargetSodium/glucose cotransporter 2(Homo sapiens (Human))
Green Cross
US Patent
LigandPNGBDBM159502(US9034921, E144 | US9340521, E019)
Affinity DataIC50:  0.980nMpH: 7.4 T: 2°C. Assay description: For sodium-dependent glucose transport assay, cells expressing hSGLT2 were seeded into a 96-well culture plate at a density of 5×104 cells/well...
In DepthDetails US Patent