BDBM160793 US9682980, 8-Chloro-N-(4-phenylcyclohexyl)-3-(2,2,2-trifluoroethyl)-[1,2,4]triazolo[4,3-b]pyridazin-7-amine
SMILES FC(F)(F)Cc1nnc2c(Cl)c(NC3CCC(CC3)c3ccccc3)cnn12
InChI Key InChIKey=LLOZLPXPADEDQU-UHFFFAOYSA-N
Data  1 EC50
  Tab Delimited (TSV)   2D SDfile   Computed 3D by Vconf -m prep SDfile
Find this compound or compounds like it in BindingDB:
Activity Spreadsheet -- Enzyme Inhibition Constant Data from BindingDB
Found 1 hit for monomerid = 160793
TargetMetabotropic glutamate receptor 2(Homo sapiens (Human))
Bristol-Myers Squibb
US Patent
LigandPNGBDBM160793(US9682980, 8-Chloro-N-(4-phenylcyclohexyl)-3-(2,2,...)
Affinity DataEC50:  733nMpH: 7.0Assay Description:Clonally expressed human mGluR2 in HEK293 background was glutamate starved overnight in media without glutamine (GIBCO MEM 12360), containing 10% FBS...
Ligand InfoPC cidPC sid
In DepthDetails US Patent