BDBM161342 US10087143, Compound 127::US11673864, Compound 127::US9051270, 127::US9758483, Compound 127
SMILES FC(F)(F)c1ccc(C(=O)Nc2cc[nH]c(=O)c2)c(OC2CC3CCC2C3)c1
InChI Key
Data  4 IC50
  Tab Delimited (TSV)   2D SDfile   Computed 3D by Vconf -m prep SDfile
Find this compound or compounds like it in BindingDB:
Activity Spreadsheet -- Enzyme Inhibition Constant Data from BindingDB
Found 4 hits for monomerid = 161342
TargetSodium channel protein type 10 subunit alpha(Rattus norvegicus (Rat))
Vertex Pharmaceuticals
US Patent
LigandPNGBDBM161342(US10087143, Compound 127 | US11673864, Compound 12...)
Affinity DataIC50:  1.30E+3nM. Assay description: Patch clamp electrophysiology was used to assess the efficacy and selectivity of sodium channel blockers in dorsal root ganglion neurons. Rat neurons...
In DepthDetails US Patent
TargetSodium channel protein type 8 subunit alpha(Homo sapiens (Human))
Vertex Pharmaceuticals
US Patent
LigandPNGBDBM161342(US10087143, Compound 127 | US11673864, Compound 12...)
Affinity DataIC50:  1.30E+3nM. Assay description: 1) Pre-spotted compounds (in neat DMSO) into compound plates. Vehicle control (neat DMSO), the positive control (20 mM DMSO stock tetracaine, 125 ...
In DepthDetails US Patent
TargetSodium channel protein type 10 subunit alpha(Homo sapiens (Human))
Vertex Pharmaceuticals
US Patent
LigandPNGBDBM161342(US10087143, Compound 127 | US11673864, Compound 12...)
Affinity DataIC50:  1.30E+3nM. Assay description: 1) Pre-spotted compounds (in neat DMSO) into compound plates. Vehicle control (neat DMSO), the positive control (20 mM DMSO stock tetracaine, 125 ...
In DepthDetails US Patent
TargetSodium channel protein type 10 subunit alpha(Homo sapiens (Human))
Vertex Pharmaceuticals
US Patent
LigandPNGBDBM161342(US10087143, Compound 127 | US11673864, Compound 12...)
Affinity DataIC50:  1.30E+3nM. Assay description: Sodium channels are voltage-dependent proteins that can be activated by inducing membrane voltage changes by applying electric fields. The electrical...
In DepthDetails US Patent