BDBM162030 US9682991, 86
SMILES CC(C)NCC1CCN(CC1)c1nn2c(nnc2c2N(C)CCOc12)-c1cccc(OC(F)(F)F)c1
InChI Key InChIKey=LTDNKZSWXYPFSO-UHFFFAOYSA-N
Data  3 IC50
  Tab Delimited (TSV)   2D SDfile   Computed 3D by Vconf -m prep SDfile
Find this compound or compounds like it in BindingDB:
Activity Spreadsheet -- Enzyme Inhibition Constant Data from BindingDB
Found 3 hits for monomerid = 162030
TargetSerine/threonine-protein kinase pim-1(Homo sapiens (Human))
FundaciÓN Centro Nacional De Investigaciones Oncologicas Carlos Iii
US Patent
LigandPNGBDBM162030(US9682991, 86)
Affinity DataIC50:  550nM. Assay description: The biochemical assay to measure PIM-1 activity relies on the ADP Hunter assay kit (DiscoveRx Corp., Cat. #90-0077), that determines the amount of AD...
Ligand InfoPC cidPC sid
In DepthDetails US Patent
TargetSerine/threonine-protein kinase pim-3(Homo sapiens (Human))
FundaciÓN Centro Nacional De Investigaciones Oncologicas Carlos Iii
US Patent
LigandPNGBDBM162030(US9682991, 86)
Affinity DataIC50:  550nM. Assay description: The biochemical assay to measure PIM-3 activity relies on the ADP Hunter assay kit (DiscoveRx Corp., Cat. #90-0077), that determines the amount of AD...
Ligand InfoPC cidPC sid
In DepthDetails US Patent
TargetSerine/threonine-protein kinase pim-2(Homo sapiens (Human))
FundaciÓN Centro Nacional De Investigaciones Oncologicas Carlos Iii
US Patent
LigandPNGBDBM162030(US9682991, 86)
Affinity DataIC50: >1.00E+3nM. Assay description: The biochemical assay to measure PIM-2 activity relies on the ADP Hunter assay kit (DiscoveRx Corp., Cat. #90-0077), that determines the amount of AD...
Ligand InfoPC cidPC sid
In DepthDetails US Patent