BDBM166785 US10604504, Example 233::US11623921, Example 233::US9688629, 233::US9802915, Example 233::US9920031, Example 233
SMILES Cc1[nH]c2c(cc(F)c(C3=CN(CCC3)C(=O)C=C)c2c1C)C(N)=O
InChI Key InChIKey=VYKRDIRQBTWCGQ-UHFFFAOYSA-N
Data  5 IC50
  Tab Delimited (TSV)   2D SDfile   Computed 3D by Vconf -m prep SDfile
Find this compound or compounds like it in BindingDB:
Activity Spreadsheet -- Enzyme Inhibition Constant Data from BindingDB
Found 5 hits for monomerid = 166785
TargetTyrosine-protein kinase BTK(Homo sapiens (Human))
Bristol-Myers Squibb
US Patent
LigandPNGBDBM166785(US10604504, Example 233 | US11623921, Example 233 ...)
Affinity DataIC50:  0.100nMpH: 7.4 T: 2°C. Assay description: To V-bottom 384-well plates were added test compounds, human recombinant Btk (1 nM, Invitrogen Corporation), fluoresceinated peptide (1.5 μM), A...
Ligand InfoPC cidPC sid
In DepthDetails US Patent
TargetTyrosine-protein kinase BTK(Homo sapiens (Human))
Bristol-Myers Squibb
US Patent
LigandPNGBDBM166785(US10604504, Example 233 | US11623921, Example 233 ...)
Affinity DataIC50:  0.100nM. Assay description: To V-bottom 384-well plates were added test compounds, human recombinant Btk (1 nM, Invitrogen Corporation), fluoresceinated peptide (1.5 μM), A...
Ligand InfoPC cidPC sid
In DepthDetails US Patent
TargetTyrosine-protein kinase BTK(Homo sapiens (Human))
Bristol-Myers Squibb
US Patent
LigandPNGBDBM166785(US10604504, Example 233 | US11623921, Example 233 ...)
Affinity DataIC50:  0.100nM. Assay description: To V-bottom 384-well plates were added test compounds, human recombinant Btk (1 nM, Invitrogen Corporation), fluoresceinated peptide (1.5 μM), A...
Ligand InfoPC cidPC sid
In DepthDetails US Patent
TargetTyrosine-protein kinase BTK(Homo sapiens (Human))
Bristol-Myers Squibb
US Patent
LigandPNGBDBM166785(US10604504, Example 233 | US11623921, Example 233 ...)
Affinity DataIC50:  0.100nM. Assay description: To V-bottom 384-well plates were added test compounds, human recombinant Btk (1 nM, Invitrogen Corporation), fluoresceinated peptide (1.5 μM), A...
Ligand InfoPC cidPC sid
In DepthDetails US Patent
TargetTyrosine-protein kinase BTK(Homo sapiens (Human))
Bristol-Myers Squibb
US Patent
LigandPNGBDBM166785(US10604504, Example 233 | US11623921, Example 233 ...)
Affinity DataIC50:  0.100nM. Assay description: To V-bottom 384-well plates were added test compounds, human recombinant Btk (1 nM, Invitrogen Corporation), fluoresceinated peptide (1.5 μM), A...
Ligand InfoPC cidPC sid
In DepthDetails US Patent